Reaction Details
TargetSigma non-opioid intracellular receptor 1
LigandBDBM50108653
Substrate/Competitorn/a
Meas. Tech.ChEMBL_822510 (CHEMBL2039327)
Ki 1.3±n/a nM
Citation Jasper, ASchepmann, DLehmkuhl, KVela, JMBuschmann, HHolenz, JWünsch, B Microwave assisted synthesis of spirocyclic pyrrolidines -s1 receptor ligands with modified benzene-N-distance. Eur J Med Chem53:327-36 (2012) 
 
Sigma non-opioid intracellular receptor 1
Name:Sigma non-opioid intracellular receptor 1
Type:Protein
Mol. Mass.:25307.17
Organism:Cavia porcellus (Guinea pig)
Description:Q60492
Residue:223
BDBM50108653
NameBDBM50108653
Synonyms:1'-benzyl-3-methoxyspiro[3,4-dihydro-1H-isochromene-1,4'-(hexahydropyridine)] CHEMBL141209
TypeSmall organic molecule
Emp. Form.C21H25NO2
Mol. Mass.323.4287
SMILESCOC1Cc2ccccc2C2(CCN(Cc3ccccc3)CC2)O1