Reaction Details
TargetD-alanyl-D-alanine carboxypeptidase
LigandBDBM50385268
Substrate/Competitorn/a
Meas. Tech.ChEMBL_822527 (CHEMBL2039460)
IC50 600±n/a nM
Citation Zervosen, ABouillez, AHerman, AAmoroso, AJoris, BSauvage, ECharlier, PLuxen, A Synthesis and evaluation of boronic acids as inhibitors of Penicillin Binding Proteins of classes A, B and C. Bioorg Med Chem20:3915-24 (2012) 
 
D-alanyl-D-alanine carboxypeptidase
Name:D-alanyl-D-alanine carboxypeptidase
Type:PROTEIN
Mol. Mass.:54928.46
Organism:Actinomadura sp. (strain R39)
Description:ChEMBL_822544
Residue:538
BDBM50385268
NameBDBM50385268
Synonyms:CHEMBL2035292
TypeSmall organic molecule
Emp. Form.C8H9BN2O5
Mol. Mass.223.978
SMILESOB(O)CNC(=O)c1ccccc1[N+]([O-])=O