Reaction Details
TargetD-alanyl-D-alanine carboxypeptidase
LigandBDBM50385263
Substrate/Competitorn/a
Meas. Tech.ChEMBL_822544 (CHEMBL2039477)
Ki 42000±n/a nM
Citation Zervosen, ABouillez, AHerman, AAmoroso, AJoris, BSauvage, ECharlier, PLuxen, A Synthesis and evaluation of boronic acids as inhibitors of Penicillin Binding Proteins of classes A, B and C. Bioorg Med Chem20:3915-24 (2012) 
 
D-alanyl-D-alanine carboxypeptidase
Name:D-alanyl-D-alanine carboxypeptidase
Type:PROTEIN
Mol. Mass.:54928.46
Organism:Actinomadura sp. (strain R39)
Description:ChEMBL_822544
Residue:538
BDBM50385263
NameBDBM50385263
Synonyms:CHEMBL2035289
TypeSmall organic molecule
Emp. Form.C8H9BClNO3
Mol. Mass.213.426
SMILESOB(O)CNC(=O)c1ccccc1Cl