Reaction Details
TargetCalcitonin gene-related peptide type 1 receptor
LigandBDBM50385309
Substrate/Competitorn/a
Meas. Tech.ChEMBL_822704 (CHEMBL2040021)
IC50 0.230000±n/a nM
Citation Bell, IMStump, CAGallicchio, SNStaas, DDZartman, CBMoore, ELSain, NUrban, MBruno, JGCalamari, AKemmerer, ALMosser, SDFandozzi, CWhite, RBZrada, MMSelnick, HGGraham, SLVacca, JPKane, SASalvatore, CA MK-8825: a potent and selective CGRP receptor antagonist with good oral activity in rats. Bioorg Med Chem Lett22:3941-5 (2012) 
 
Calcitonin gene-related peptide type 1 receptor
Name:Calcitonin gene-related peptide type 1 receptor
Type:Enzyme Catalytic Domain
Mol. Mass.:52980.45
Organism:Homo sapiens (Human)
Description:Q16602
Residue:461
BDBM50385309
NameBDBM50385309
Synonyms:CHEMBL2035983
TypeSmall organic molecule
Emp. Form.C31H30F2N6O3
Mol. Mass.572.6051
SMILESC[C@]1(CNC2(CCCC2)C(=O)N1CC(=O)Nc1cnc2C[C@]3(Cc2c1)C(=O)Nc1ncccc31)c1cc(F)cc(F)c1