Reaction Details
TargetCalcitonin gene-related peptide type 1 receptor
LigandBDBM50385313
Substrate/Competitorn/a
Meas. Tech.ChEMBL_822689 (CHEMBL2040006)
Ki 38±n/a nM
Citation Bell, IMStump, CAGallicchio, SNStaas, DDZartman, CBMoore, ELSain, NUrban, MBruno, JGCalamari, AKemmerer, ALMosser, SDFandozzi, CWhite, RBZrada, MMSelnick, HGGraham, SLVacca, JPKane, SASalvatore, CA MK-8825: a potent and selective CGRP receptor antagonist with good oral activity in rats. Bioorg Med Chem Lett22:3941-5 (2012) 
 
Calcitonin gene-related peptide type 1 receptor
Name:Calcitonin gene-related peptide type 1 receptor
Type:PROTEIN
Mol. Mass.:53330.91
Organism:Rattus norvegicus
Description:ChEMBL_1457286
Residue:464
BDBM50385313
NameBDBM50385313
Synonyms:CHEMBL2035982
TypeSmall organic molecule
Emp. Form.C30H28F2N6O3
Mol. Mass.558.5785
SMILESFc1cc(F)cc(c1)[C@@H]1CNC2(CCCC2)C(=O)N1CC(=O)Nc1cnc2C[C@]3(Cc2c1)C(=O)Nc1ncccc31