Reaction Details
TargetCalcitonin gene-related peptide type 1 receptor/Receptor activity-modifying protein 2
LigandBDBM50385309
Substrate/Competitorn/a
Meas. Tech.ChEMBL_822727 (CHEMBL2040044)
Ki>20000±n/a nM
Citation Bell, IMStump, CAGallicchio, SNStaas, DDZartman, CBMoore, ELSain, NUrban, MBruno, JGCalamari, AKemmerer, ALMosser, SDFandozzi, CWhite, RBZrada, MMSelnick, HGGraham, SLVacca, JPKane, SASalvatore, CA MK-8825: a potent and selective CGRP receptor antagonist with good oral activity in rats. Bioorg Med Chem Lett22:3941-5 (2012) 
 
Calcitonin gene-related peptide type 1 receptor/Receptor activity-modifying protein 2
Name:Calcitonin gene-related peptide type 1 receptor/Receptor activity-modifying protein 2
Synonyms:Adrenomedullin receptor AM1, CALCRL/RAMP2
Type:n/a
Mol. Mass.:n/a
Description:ASSAY_ID of EBI is 822727
Components:This complex has 2 components.
Component 1
Name:Receptor activity-modifying protein 2
Type:PROTEIN
Mol. Mass.:19604.93
Organism:Homo sapiens (Human)
Description:EBI_100672
Residue:175
Component 2
Name:Calcitonin gene-related peptide type 1 receptor
Synonyms:Adrenomedullin receptor AM1; CALCRL/RAMP2 CALRL_HUMAN CGRP type 1 receptor mRNA Calcitonin gene-related peptide (CGRP) receptor Calcitonin receptor-like receptor Human CL receptor
Type:Enzyme Catalytic Domain
Mol. Mass.:52980.45
Organism:Homo sapiens (Human)
Description:Q16602
Residue:461
BDBM50385309
NameBDBM50385309
Synonyms:CHEMBL2035983
TypeSmall organic molecule
Emp. Form.C31H30F2N6O3
Mol. Mass.572.6051
SMILESC[C@]1(CNC2(CCCC2)C(=O)N1CC(=O)Nc1cnc2C[C@]3(Cc2c1)C(=O)Nc1ncccc31)c1cc(F)cc(F)c1