Reaction Details
TargetPolymerase acidic protein
LigandBDBM50125801
Substrate/Competitorn/a
Meas. Tech.ChEMBL_823233 (CHEMBL2040651)
Ki 90±n/a nM
Citation Baughman, BMJake Slavish, PDuBois, RMBoyd, VAWhite, SWWebb, TR Identification of influenza endonuclease inhibitors using a novel fluorescence polarization assay. ACS Chem Biol7:526-34 (2012) 
 
Polymerase acidic protein
Name:Polymerase acidic protein
Type:PROTEIN
Mol. Mass.:82573.84
Organism:Hepatitis C virus
Description:ChEMBL_64976
Residue:716
BDBM50125801
NameBDBM50125801
Synonyms:4-[1-Benzyl-4-(4-chloro-benzyl)-piperidin-4-yl]-2-hydroxy-4-oxo-but-2-enoic acid CHEMBL463590
TypeSmall organic molecule
Emp. Form.C23H24ClNO4
Mol. Mass.413.894
SMILESOC(=O)C(=O)CC(=O)C1(Cc2ccc(Cl)cc2)CCN(Cc2ccccc2)CC1