Reaction Details
TargetPolymerase acidic protein
LigandBDBM33410
Substrate/Competitorn/a
Meas. Tech.ChEMBL_823233 (CHEMBL2040651)
Ki 850±n/a nM
Citation Baughman, BMJake Slavish, PDuBois, RMBoyd, VAWhite, SWWebb, TR Identification of influenza endonuclease inhibitors using a novel fluorescence polarization assay. ACS Chem Biol7:526-34 (2012) 
 
Polymerase acidic protein
Name:Polymerase acidic protein
Type:PROTEIN
Mol. Mass.:82573.84
Organism:Hepatitis C virus
Description:ChEMBL_64976
Residue:716
BDBM33410
NameBDBM33410
Synonyms:CHEMBL16755 | N-hydroxyisoquinolinedione, 2
TypeSmall organic molecule
Emp. Form.C9H7NO3
Mol. Mass.177.1568
SMILESON1C(=O)Cc2ccccc2C1=O