Reaction Details
TargetPolymerase acidic protein
LigandBDBM50385500
Substrate/Competitorn/a
Meas. Tech.ChEMBL_823233 (CHEMBL2040651)
Ki 300±n/a nM
Citation Baughman, BMJake Slavish, PDuBois, RMBoyd, VAWhite, SWWebb, TR Identification of influenza endonuclease inhibitors using a novel fluorescence polarization assay. ACS Chem Biol7:526-34 (2012) 
 
Polymerase acidic protein
Name:Polymerase acidic protein
Type:PROTEIN
Mol. Mass.:82573.84
Organism:Hepatitis C virus
Description:ChEMBL_64976
Residue:716
BDBM50385500
NameBDBM50385500
Synonyms:CHEMBL2040552
TypeSmall organic molecule
Emp. Form.C14H16N2O4
Mol. Mass.276.2878
SMILESOC(=O)C(=O)CC(=O)c1ccc(cc1)N1CCNCC1