Reaction Details
TargetPolymerase acidic protein
LigandBDBM50385509
Substrate/Competitorn/a
Meas. Tech.ChEMBL_823233 (CHEMBL2040651)
Ki 20300±n/a nM
Citation Baughman, BMJake Slavish, PDuBois, RMBoyd, VAWhite, SWWebb, TR Identification of influenza endonuclease inhibitors using a novel fluorescence polarization assay. ACS Chem Biol7:526-34 (2012) 
 
Polymerase acidic protein
Name:Polymerase acidic protein
Type:PROTEIN
Mol. Mass.:82573.84
Organism:Hepatitis C virus
Description:ChEMBL_64976
Residue:716
BDBM50385509
NameBDBM50385509
Synonyms:CHEMBL2040564
TypeSmall organic molecule
Emp. Form.C10H10N4O4
Mol. Mass.250.2108
SMILESCOC(=O)c1nc([nH]c(=O)c1O)-c1cn(C)cn1