Reaction Details
TargetPolymerase acidic protein
LigandBDBM50385513
Substrate/Competitorn/a
Meas. Tech.ChEMBL_823233 (CHEMBL2040651)
Ki 38600±n/a nM
Citation Baughman, BMJake Slavish, PDuBois, RMBoyd, VAWhite, SWWebb, TR Identification of influenza endonuclease inhibitors using a novel fluorescence polarization assay. ACS Chem Biol7:526-34 (2012) 
 
Polymerase acidic protein
Name:Polymerase acidic protein
Type:PROTEIN
Mol. Mass.:82573.84
Organism:Hepatitis C virus
Description:ChEMBL_64976
Residue:716
BDBM50385513
NameBDBM50385513
Synonyms:CHEMBL2040567
TypeSmall organic molecule
Emp. Form.C11H9N3O4
Mol. Mass.247.2069
SMILESCc1cccnc1-c1nc(C(O)=O)c(O)c(=O)[nH]1