Reaction Details
TargetPolymerase acidic protein
LigandBDBM50385518
Substrate/Competitorn/a
Meas. Tech.ChEMBL_823233 (CHEMBL2040651)
Ki 3556±n/a nM
Citation Baughman, BMJake Slavish, PDuBois, RMBoyd, VAWhite, SWWebb, TR Identification of influenza endonuclease inhibitors using a novel fluorescence polarization assay. ACS Chem Biol7:526-34 (2012) 
 
Polymerase acidic protein
Name:Polymerase acidic protein
Type:PROTEIN
Mol. Mass.:82573.84
Organism:Hepatitis C virus
Description:ChEMBL_64976
Residue:716
BDBM50385518
NameBDBM50385518
Synonyms:CHEMBL2040573
TypeSmall organic molecule
Emp. Form.C15H17N5O3
Mol. Mass.315.3272
SMILESOc1c(nc([nH]c1=O)-c1cnccn1)C(=O)NC1CCCCC1