Reaction Details
TargetPolymerase acidic protein
LigandBDBM50385529
Substrate/Competitorn/a
Meas. Tech.ChEMBL_823236 (CHEMBL2040654)
IC50 1100±n/a nM
Citation Hastings, JCSelnick, HWolanski, BTomassini, JE Anti-influenza virus activities of 4-substituted 2,4-dioxobutanoic acid inhibitors. Antimicrob Agents Chemother40:1304-7 (1996) Polymerase acidic protein
Name:Polymerase acidic protein
Type:PROTEIN
Mol. Mass.:82573.84
Organism:Hepatitis C virus
Description:ChEMBL_64976
Residue:716
BDBM50385529
NameBDBM50385529
Synonyms:CHEMBL2040587
TypeSmall organic molecule
Emp. Form.C23H24ClNO4
Mol. Mass.413.894
SMILESOC(=O)C(=O)CC(=O)C1(Cc2ccc(Cl)cc2)CCCN(Cc2ccccc2)C1