Reaction Details
TargetPolymerase acidic protein
LigandBDBM50385533
Substrate/Competitorn/a
Meas. Tech.ChEMBL_823246 (CHEMBL2040664)
IC50 7300±n/a nM
Citation Singh, SBTomassini, JE Synthesis of natural flutimide and analogous fully substituted pyrazine-2,6-diones, endonuclease inhibitors of influenza virus. J Org Chem66:5504-16 (2001) Polymerase acidic protein
Name:Polymerase acidic protein
Type:PROTEIN
Mol. Mass.:82573.84
Organism:Hepatitis C virus
Description:ChEMBL_64976
Residue:716
BDBM50385533
NameBDBM50385533
Synonyms:CHEMBL2040604
TypeSmall organic molecule
Emp. Form.C15H15FN2O3
Mol. Mass.290.2896
SMILESCC(C)C=c1[nH]c(=Cc2ccccc2F)c(=O)n(O)c1=O