Reaction Details
TargetAMP deaminase 3
LigandBDBM50385587
Substrate/Competitorn/a
Meas. Tech.ChEMBL_825837 (CHEMBL2044566)
IC50 370000±n/a nM
Citation Lindell, SDMaechling, SSabina, RL Synthesis and Biochemical Testing of 3-(Carboxyphenylethyl)imidazo[2,1-f][1,2,4]triazines as Inhibitors of AMP Deaminase. ACS Med Chem Lett1:286-289 (2010) 
 
AMP deaminase 3
Name:AMP deaminase 3
Type:Protein
Mol. Mass.:88818.80
Organism:Homo sapiens (Human)
Description:n/a
Residue:767
BDBM50385587
NameBDBM50385587
Synonyms:CHEMBL2042529
TypeSmall organic molecule
Emp. Form.C14H12N4O2
Mol. Mass.268.2707
SMILESOC(=O)c1cccc(CCc2cnc3cncnn23)c1