Reaction Details
TargetAdenosine receptor A3
LigandBDBM50385634
Substrate/Competitorn/a
Meas. Tech.ChEMBL_823418 (CHEMBL2046086)
Ki>10000±n/a nM
Citation El-Tayeb, AMichael, SAbdelrahman, ABehrenswerth, AGollos, SNieber, KMüller, CE Development of Polar Adenosine A2A Receptor Agonists for Inflammatory Bowel Disease: Synergism with A2B Antagonists. ACS Med Chem Lett2:890-895 (2011) 
 
Adenosine receptor A3
Name:Adenosine receptor A3
Type:G Protein-Coupled Receptor (GPCR)
Mol. Mass.:36197.32
Organism:Homo sapiens (Human)
Description:P0DMS8
Residue:318
BDBM50385634
NameBDBM50385634
Synonyms:CHEMBL2043295
TypeSmall organic molecule
Emp. Form.C18H21N5O7S2
Mol. Mass.483.519
SMILESNc1nc(SCCc2ccc(cc2)S(O)(=O)=O)nc2n(cnc12)[C@@H]1O[C@H](CO)[C@@H](O)[C@H]1O