Reaction Details
TargetAdenosine receptor A1
LigandBDBM50385633
Substrate/Competitorn/a
Meas. Tech.ChEMBL_823412 (CHEMBL2046071)
Ki 1930±n/a nM
Citation El-Tayeb, AMichael, SAbdelrahman, ABehrenswerth, AGollos, SNieber, KMüller, CE Development of Polar Adenosine A2A Receptor Agonists for Inflammatory Bowel Disease: Synergism with A2B Antagonists. ACS Med Chem Lett2:890-895 (2011) 
 
Adenosine receptor A1
Name:Adenosine receptor A1
Type:Protein
Mol. Mass.:36704.13
Organism:Rattus norvegicus (rat)
Description:n/a
Residue:326
BDBM50385633
NameBDBM50385633
Synonyms:CHEMBL2043428
TypeSmall organic molecule
Emp. Form.C12H15N5O6S
Mol. Mass.357.342
SMILESNc1nc(SCC(O)=O)nc2n(cnc12)[C@@H]1O[C@H](CO)[C@@H](O)[C@H]1O