Reaction Details
TargetAdenosine receptor A2a
LigandBDBM50385631
Substrate/Competitorn/a
Meas. Tech.ChEMBL_823416 (CHEMBL2046084)
Ki>10000±n/a nM
Citation El-Tayeb, AMichael, SAbdelrahman, ABehrenswerth, AGollos, SNieber, KMüller, CE Development of Polar Adenosine A2A Receptor Agonists for Inflammatory Bowel Disease: Synergism with A2B Antagonists. ACS Med Chem Lett2:890-895 (2011) 
 
Adenosine receptor A2a
Name:Adenosine receptor A2a
Type:G Protein-Coupled Receptor (GPCR)
Mol. Mass.:44716.46
Organism:Homo sapiens (Human)
Description:P29274
Residue:412
BDBM50385631
NameBDBM50385631
Synonyms:CHEMBL2043426
TypeSmall organic molecule
Emp. Form.C18H21N5O9S2
Mol. Mass.515.517
SMILESNc1nc(nc2n(cnc12)[C@@H]1O[C@H](CO)[C@@H](O)[C@H]1O)S(=O)(=O)CCc1ccc(cc1)S(O)(=O)=O