Reaction Details
TargetMitogen-activated protein kinase 14
LigandBDBM50385649
Substrate/Competitorn/a
Meas. Tech.ChEMBL_823429 (CHEMBL2046097)
IC50 17±n/a nM
Citation Dyrager, CMöllers, LNKjäll, LKAlao, JPDinér, PWallner, FKSunnerhagen, PGrøtli, M Design, synthesis, and biological evaluation of chromone-based p38 MAP kinase inhibitors. J Med Chem54:7427-31 (2011) 
 
Mitogen-activated protein kinase 14
Name:Mitogen-activated protein kinase 14
Type:Serine/threonine-protein kinase
Mol. Mass.:41286.76
Organism:Homo sapiens (Human)
Description:Q16539
Residue:360
BDBM50385649
NameBDBM50385649
Synonyms:CHEMBL2041958
TypeSmall organic molecule
Emp. Form.C23H19FN2O2
Mol. Mass.374.4076
SMILESCC(C)Nc1cc(ccn1)-c1oc2ccccc2c(=O)c1-c1ccc(F)cc1