Reaction Details
TargetMitogen-activated protein kinase 14
LigandBDBM50385653
Substrate/Competitorn/a
Meas. Tech.ChEMBL_823429 (CHEMBL2046097)
IC50 34±n/a nM
Citation Dyrager, CMöllers, LNKjäll, LKAlao, JPDinér, PWallner, FKSunnerhagen, PGrøtli, M Design, synthesis, and biological evaluation of chromone-based p38 MAP kinase inhibitors. J Med Chem54:7427-31 (2011) 
 
Mitogen-activated protein kinase 14
Name:Mitogen-activated protein kinase 14
Type:Serine/threonine-protein kinase
Mol. Mass.:41286.76
Organism:Homo sapiens (Human)
Description:Q16539
Residue:360
BDBM50385653
NameBDBM50385653
Synonyms:CHEMBL2041962
TypeSmall organic molecule
Emp. Form.C26H23FN2O2
Mol. Mass.414.4714
SMILESFc1ccc(cc1)-c1c(oc2ccccc2c1=O)-c1ccnc(NC2CCCCC2)c1