Reaction Details
TargetMuscarinic acetylcholine receptor M4
LigandBDBM50385679
Substrate/Competitorn/a
Meas. Tech.ChEMBL_826081 (CHEMBL2045512)
Ki 1.48±n/a nM
Citation Del Bello, FBarocelli, EBertoni, SBonifazi, ACamalli, MCampi, GGiannella, MMatucci, RNesi, MPigini, MQuaglia, WPiergentili, A 1,4-dioxane, a suitable scaffold for the development of novel M3 muscarinic receptor antagonists. J Med Chem55:1783-7 (2012) 
 
Muscarinic acetylcholine receptor M4
Name:Muscarinic acetylcholine receptor M4
Type:Enzyme Catalytic Domain
Mol. Mass.:53079.31
Organism:Homo sapiens (Human)
Description:Cholinergic, muscarinic M4 CHRM4 HUMAN M3::P08173
Residue:479
BDBM50385679
NameBDBM50385679
Synonyms:CHEMBL2042405
TypeSmall organic molecule
Emp. Form.C20H26NO2
Mol. Mass.312.4254
SMILESC[N+](C)(C)C[C@H]1COCC(O1)(c1ccccc1)c1ccccc1