Reaction Details
TargetMuscarinic acetylcholine receptor M4
LigandBDBM50385675
Substrate/Competitorn/a
Meas. Tech.ChEMBL_826081 (CHEMBL2045512)
Ki 25118.86±n/a nM
Citation Del Bello, FBarocelli, EBertoni, SBonifazi, ACamalli, MCampi, GGiannella, MMatucci, RNesi, MPigini, MQuaglia, WPiergentili, A 1,4-dioxane, a suitable scaffold for the development of novel M3 muscarinic receptor antagonists. J Med Chem55:1783-7 (2012) 
 
Muscarinic acetylcholine receptor M4
Name:Muscarinic acetylcholine receptor M4
Type:Enzyme Catalytic Domain
Mol. Mass.:53079.31
Organism:Homo sapiens (Human)
Description:Cholinergic, muscarinic M4 CHRM4 HUMAN M3::P08173
Residue:479
BDBM50385675
NameBDBM50385675
Synonyms:CHEMBL2042400
TypeSmall organic molecule
Emp. Form.C10H22NO2
Mol. Mass.188.2866
SMILESCC[C@H]1COC[C@@H](C[N+](C)(C)C)O1