Reaction Details
TargetMuscarinic acetylcholine receptor M3
LigandBDBM50385680
Substrate/Competitorn/a
Meas. Tech.ChEMBL_826080 (CHEMBL2045511)
Ki 9772.37±n/a nM
Citation Del Bello, FBarocelli, EBertoni, SBonifazi, ACamalli, MCampi, GGiannella, MMatucci, RNesi, MPigini, MQuaglia, WPiergentili, A 1,4-dioxane, a suitable scaffold for the development of novel M3 muscarinic receptor antagonists. J Med Chem55:1783-7 (2012) 
 
Muscarinic acetylcholine receptor M3
Name:Muscarinic acetylcholine receptor M3
Type:Enzyme
Mol. Mass.:66151.03
Organism:Homo sapiens (Human)
Description:P20309
Residue:590
BDBM50385680
NameBDBM50385680
Synonyms:CHEMBL2042402
TypeSmall organic molecule
Emp. Form.C14H22NO2
Mol. Mass.236.3294
SMILESC[N+](C)(C)C[C@@H]1COC[C@@H](O1)c1ccccc1