Reaction Details
TargetMuscarinic acetylcholine receptor M1
LigandBDBM50385678
Substrate/Competitorn/a
Meas. Tech.ChEMBL_826078 (CHEMBL2045509)
Ki 3801.89±n/a nM
Citation Del Bello, FBarocelli, EBertoni, SBonifazi, ACamalli, MCampi, GGiannella, MMatucci, RNesi, MPigini, MQuaglia, WPiergentili, A 1,4-dioxane, a suitable scaffold for the development of novel M3 muscarinic receptor antagonists. J Med Chem55:1783-7 (2012) 
 
Muscarinic acetylcholine receptor M1
Name:Muscarinic acetylcholine receptor M1
Type:Protein
Mol. Mass.:51442.54
Organism:Homo sapiens (Human)
Description:P11229
Residue:460
BDBM50385678
NameBDBM50385678
Synonyms:CHEMBL2042407
TypeSmall organic molecule
Emp. Form.C21H28NO2
Mol. Mass.326.452
SMILESC[N+](C)(C)C[C@@H]1COC[C@@H](O1)C(c1ccccc1)c1ccccc1