Reaction Details
TargetMuscarinic acetylcholine receptor M4
LigandBDBM50165019
Substrate/Competitorn/a
Meas. Tech.ChEMBL_826081 (CHEMBL2045512)
Ki 3.63±n/a nM
Citation Del Bello, FBarocelli, EBertoni, SBonifazi, ACamalli, MCampi, GGiannella, MMatucci, RNesi, MPigini, MQuaglia, WPiergentili, A 1,4-dioxane, a suitable scaffold for the development of novel M3 muscarinic receptor antagonists. J Med Chem55:1783-7 (2012) 
 
Muscarinic acetylcholine receptor M4
Name:Muscarinic acetylcholine receptor M4
Type:Enzyme Catalytic Domain
Mol. Mass.:53079.31
Organism:Homo sapiens (Human)
Description:Cholinergic, muscarinic M4 CHRM4 HUMAN M3::P08173
Residue:479
BDBM50165019
NameBDBM50165019
Synonyms:4-(Diethylamino)-2-butynyl alpha-phenylcyclohexaneglycolic acid ester 4-Diethylamino-2-butinyl alpha-cyclohexylmandelat Benzeneacetic acid, alpha-cyclohexyl-alpha-hydroxy-, 4-(diethylamino)-2-butynyl ester Cyclohexaneglycolic acid, alpha-phenyl-, 4-(diethylamino)-2-butynyl ester | OXYBUTYNIN CHLORIDE
TypeSmall organic molecule
Emp. Form.C22H31NO3
Mol. Mass.357.4864
SMILESCCN(CC)CC#CCOC(=O)C(O)(C1CCCCC1)c1ccccc1