Reaction Details
TargetAldo-keto reductase family 1 member C3
LigandBDBM50385689
Substrate/Competitorn/a
Meas. Tech.ChEMBL_823517 (CHEMBL2046255)
IC50 40±n/a nM
Citation Adeniji, AOTwenter, BMByrns, MCJin, YChen, MWinkler, JDPenning, TM Development of potent and selective inhibitors of aldo-keto reductase 1C3 (type 5 17ß-hydroxysteroid dehydrogenase) based on N-phenyl-aminobenzoates and their structure-activity relationships. J Med Chem55:2311-23 (2012) 
 
Aldo-keto reductase family 1 member C3
Name:Aldo-keto reductase family 1 member C3
Type:Enzyme
Mol. Mass.:36859.86
Organism:Homo sapiens (Human)
Description:P42330
Residue:323
BDBM50385689
NameBDBM50385689
Synonyms:CHEMBL2041557
TypeSmall organic molecule
Emp. Form.C14H9F3N2O5
Mol. Mass.342.2269
SMILESOC(=O)c1cccc(Nc2ccc(cc2OC(F)(F)F)[N+]([O-])=O)c1