Reaction Details
TargetAldo-keto reductase family 1 member C2
LigandBDBM50385716
Substrate/Competitorn/a
Meas. Tech.ChEMBL_823518 (CHEMBL2046256)
IC50 410±n/a nM
Citation Adeniji, AOTwenter, BMByrns, MCJin, YChen, MWinkler, JDPenning, TM Development of potent and selective inhibitors of aldo-keto reductase 1C3 (type 5 17ß-hydroxysteroid dehydrogenase) based on N-phenyl-aminobenzoates and their structure-activity relationships. J Med Chem55:2311-23 (2012) 
 
Aldo-keto reductase family 1 member C2
Name:Aldo-keto reductase family 1 member C2
Type:Enzyme
Mol. Mass.:36739.89
Organism:Homo sapiens (Human)
Description:n/a
Residue:323
BDBM50385716
NameBDBM50385716
Synonyms:CHEMBL2043303
TypeSmall organic molecule
Emp. Form.C13H10ClNO2
Mol. Mass.247.677
SMILESOC(=O)c1ccccc1Nc1ccc(Cl)cc1