Reaction Details
TargetAldo-keto reductase family 1 member C2
LigandBDBM50385740
Substrate/Competitorn/a
Meas. Tech.ChEMBL_823518 (CHEMBL2046256)
IC50 910±n/a nM
Citation Adeniji, AOTwenter, BMByrns, MCJin, YChen, MWinkler, JDPenning, TM Development of potent and selective inhibitors of aldo-keto reductase 1C3 (type 5 17ß-hydroxysteroid dehydrogenase) based on N-phenyl-aminobenzoates and their structure-activity relationships. J Med Chem55:2311-23 (2012) 
 
Aldo-keto reductase family 1 member C2
Name:Aldo-keto reductase family 1 member C2
Type:Enzyme
Mol. Mass.:36739.89
Organism:Homo sapiens (Human)
Description:n/a
Residue:323
BDBM50385740
NameBDBM50385740
Synonyms:CHEMBL2041002
TypeSmall organic molecule
Emp. Form.C16H15NO4
Mol. Mass.285.2946
SMILESCOc1ccc(Nc2ccc(cc2C(O)=O)C(C)=O)cc1