Reaction Details
TargetAldo-keto reductase family 1 member C4
LigandBDBM50385688
Substrate/Competitorn/a
Meas. Tech.ChEMBL_823521 (CHEMBL2045964)
IC50 20400±n/a nM
Citation Adeniji, AOTwenter, BMByrns, MCJin, YChen, MWinkler, JDPenning, TM Development of potent and selective inhibitors of aldo-keto reductase 1C3 (type 5 17ß-hydroxysteroid dehydrogenase) based on N-phenyl-aminobenzoates and their structure-activity relationships. J Med Chem55:2311-23 (2012) 
 
Aldo-keto reductase family 1 member C4
Name:Aldo-keto reductase family 1 member C4
Type:Enzyme
Mol. Mass.:37068.40
Organism:Homo sapiens (Human)
Description:P17516
Residue:323
BDBM50385688
NameBDBM50385688
Synonyms:CHEMBL2041556
TypeSmall organic molecule
Emp. Form.C14H12N2O5
Mol. Mass.288.2555
SMILESCOc1ccc(Nc2cccc(c2)C(O)=O)c(c1)[N+]([O-])=O