Reaction Details
TargetAldo-keto reductase family 1 member C3
LigandBDBM35916
Substrate/Competitorn/a
Meas. Tech.ChEMBL_823517 (CHEMBL2046255)
IC50 40±n/a nM
Citation Adeniji, AOTwenter, BMByrns, MCJin, YChen, MWinkler, JDPenning, TM Development of potent and selective inhibitors of aldo-keto reductase 1C3 (type 5 17ß-hydroxysteroid dehydrogenase) based on N-phenyl-aminobenzoates and their structure-activity relationships. J Med Chem55:2311-23 (2012) 
 
Aldo-keto reductase family 1 member C3
Name:Aldo-keto reductase family 1 member C3
Type:Enzyme
Mol. Mass.:36859.86
Organism:Homo sapiens (Human)
Description:P42330
Residue:323
BDBM35916
NameBDBM35916
Synonyms:flufenamic acid analogue, 42
TypeSmall organic molecule
Emp. Form.C17H19NO2
Mol. Mass.269.3383
SMILESCC(C)(C)c1ccc(Nc2ccccc2C(O)=O)cc1