Reaction Details
TargetAurora kinase A
LigandBDBM50385916
Substrate/Competitorn/a
Meas. Tech.ChEMBL_824219 (CHEMBL2044154)
IC50 8810±n/a nM
Citation Innocenti, PCheung, KMSolanki, SMas-Droux, CRowan, FYeoh, SBoxall, KWestlake, MPickard, LHardy, TBaxter, JEAherne, GWBayliss, RFry, AMHoelder, S Design of potent and selective hybrid inhibitors of the mitotic kinase Nek2: structure-activity relationship, structural biology, and cellular activity. J Med Chem55:3228-41 (2012) 
 
Aurora kinase A
Name:Aurora kinase A
Type:Serine/threonine-protein kinase
Mol. Mass.:45830.98
Organism:Homo sapiens (Human)
Description:O14965
Residue:403
BDBM50385916
NameBDBM50385916
Synonyms:CHEMBL2042136
TypeSmall organic molecule
Emp. Form.C28H27F3N4O2S
Mol. Mass.540.6
SMILESC[C@@H](Oc1cc(ccc1C(N)=O)-c1cc(cnc1N)-c1cc(CN(C)C)cs1)c1ccccc1C(F)(F)F