Reaction Details
TargetSerine/threonine-protein kinase PLK1
LigandBDBM50385916
Substrate/Competitorn/a
Meas. Tech.ChEMBL_824217 (CHEMBL2044152)
IC50 820±n/a nM
Citation Innocenti, PCheung, KMSolanki, SMas-Droux, CRowan, FYeoh, SBoxall, KWestlake, MPickard, LHardy, TBaxter, JEAherne, GWBayliss, RFry, AMHoelder, S Design of potent and selective hybrid inhibitors of the mitotic kinase Nek2: structure-activity relationship, structural biology, and cellular activity. J Med Chem55:3228-41 (2012) 
 
Serine/threonine-protein kinase PLK1
Name:Serine/threonine-protein kinase PLK1
Type:Serine/threonine-protein kinase
Mol. Mass.:68277.16
Organism:Homo sapiens (Human)
Description:P53350
Residue:603
BDBM50385916
NameBDBM50385916
Synonyms:CHEMBL2042136
TypeSmall organic molecule
Emp. Form.C28H27F3N4O2S
Mol. Mass.540.6
SMILESC[C@@H](Oc1cc(ccc1C(N)=O)-c1cc(cnc1N)-c1cc(CN(C)C)cs1)c1ccccc1C(F)(F)F