Reaction Details
TargetSerine/threonine-protein kinase PLK1
LigandBDBM50385919
Substrate/Competitorn/a
Meas. Tech.ChEMBL_824217 (CHEMBL2044152)
IC50 1560±n/a nM
Citation Innocenti, PCheung, KMSolanki, SMas-Droux, CRowan, FYeoh, SBoxall, KWestlake, MPickard, LHardy, TBaxter, JEAherne, GWBayliss, RFry, AMHoelder, S Design of potent and selective hybrid inhibitors of the mitotic kinase Nek2: structure-activity relationship, structural biology, and cellular activity. J Med Chem55:3228-41 (2012) 
 
Serine/threonine-protein kinase PLK1
Name:Serine/threonine-protein kinase PLK1
Type:Serine/threonine-protein kinase
Mol. Mass.:68277.16
Organism:Homo sapiens (Human)
Description:P53350
Residue:603
BDBM50385919
NameBDBM50385919
Synonyms:CHEMBL2042031
TypeSmall organic molecule
Emp. Form.C30H29F3N4O2
Mol. Mass.534.5721
SMILESCC(Oc1cc(ccc1C(N)=O)-c1cc(cnc1N)-c1ccc(CN(C)C)cc1)c1ccccc1C(F)(F)F