Reaction Details
TargetCytochrome P450 3A4
LigandBDBM520
Substrate/Competitorn/a
Meas. Tech.ChEMBL_825128 (CHEMBL2043504)
IC50 100±n/a nM
Citation Chang, MLee, SHKim, HJKoh, JSKim, A Preclinical metabolism of LB42908, a novel farnesyl transferase inhibitor, and its effects on the cytochrome P450 isozyme activities. Bioorg Med Chem Lett22:3067-71 (2012) 
 
Cytochrome P450 3A4
Name:Cytochrome P450 3A4
Type:Enzyme
Mol. Mass.:57349.57
Organism:Homo sapiens (Human)
Description:n/a
Residue:503
BDBM520
NameBDBM520
Synonyms:1,3-thiazol-5-ylmethyl N-[(2S,3S,5S)-3-hydroxy-5-[(2S)-3-methyl-2-{[methyl({[2-(propan-2-yl)-1,3-thiazol-4-yl]methyl})carbamoyl]amino}butanamido]-1,6-diphenylhexan-2-yl]carbamate CHEMBL163 RTV | Ritonavir
TypeSmall organic molecule
Emp. Form.C37H48N6O5S2
Mol. Mass.720.944
SMILESCC(C)[C@H](NC(=O)N(C)Cc1csc(n1)C(C)C)C(=O)N[C@H](C[C@H](O)[C@H](Cc1ccccc1)NC(=O)OCc1cncs1)Cc1ccccc1