Reaction Details
TargetAcetylcholinesterase
LigandBDBM50386060
Substrate/Competitorn/a
Meas. Tech.ChEMBL_823696 (CHEMBL2045011)
IC50 205±n/a nM
Citation Meng, FCMao, FShan, WJQin, FHuang, LLi, XS Design, synthesis, and evaluation of indanone derivatives as acetylcholinesterase inhibitors and metal-chelating agents. Bioorg Med Chem Lett22:4462-6 (2012) 
 
Acetylcholinesterase
Name:Acetylcholinesterase
Type:Enzyme
Mol. Mass.:71812.79
Organism:Electrophorus electricus (Electric eel)
Description:n/a
Residue:633
BDBM50386060
NameBDBM50386060
Synonyms:CHEMBL2043059
TypeSmall organic molecule
Emp. Form.C24H30N2O3
Mol. Mass.394.5066
SMILESCCN(CC)CCCCOc1cc2C(=O)\C(Cc2cc1OC)=C/c1ccncc1