Reaction Details
TargetHistamine H3 receptor
LigandBDBM50386352
Substrate/Competitorn/a
Meas. Tech.ChEMBL_826696 (CHEMBL2051143)
Ki 44±n/a nM
Citation Rao, AUShao, NAslanian, RGChan, TYDegrado, SJWang, LMcKittrick, BSenior, MWest, REWilliams, SMWu, RLHwa, JPatel, BZheng, SSondey, CPalani, A Discovery of a potent thiadiazole class of histamine h3 receptor antagonist for the treatment of diabetes. ACS Med Chem Lett3:198-202 (2012) 
 
Histamine H3 receptor
Name:Histamine H3 receptor
Type:PROTEIN
Mol. Mass.:48560.37
Organism:Mus musculus
Description:ChEMBL_988451
Residue:445
BDBM50386352
NameBDBM50386352
Synonyms:CHEMBL2048588
TypeSmall organic molecule
Emp. Form.C21H29N7S
Mol. Mass.411.567
SMILESC1CCN(CC1)C1CCN(CC1)c1nnc(s1)N1CCC=C(C1)c1ncccn1