Reaction Details
TargetHistamine H3 receptor
LigandBDBM50386356
Substrate/Competitorn/a
Meas. Tech.ChEMBL_826696 (CHEMBL2051143)
Ki 68±n/a nM
Citation Rao, AUShao, NAslanian, RGChan, TYDegrado, SJWang, LMcKittrick, BSenior, MWest, REWilliams, SMWu, RLHwa, JPatel, BZheng, SSondey, CPalani, A Discovery of a potent thiadiazole class of histamine h3 receptor antagonist for the treatment of diabetes. ACS Med Chem Lett3:198-202 (2012) 
 
Histamine H3 receptor
Name:Histamine H3 receptor
Type:PROTEIN
Mol. Mass.:48560.37
Organism:Mus musculus
Description:ChEMBL_988451
Residue:445
BDBM50386356
NameBDBM50386356
Synonyms:CHEMBL2048584
TypeSmall organic molecule
Emp. Form.C17H29N5OS
Mol. Mass.351.51
SMILESOC1CCCN(C1)c1nnc(s1)N1CCC(CC1)N1CCCCC1