Reaction Details
TargetHistamine H3 receptor
LigandBDBM50333504
Substrate/Competitorn/a
Meas. Tech.ChEMBL_826695 (CHEMBL2051142)
Ki 49±n/a nM
Citation Rao, AUShao, NAslanian, RGChan, TYDegrado, SJWang, LMcKittrick, BSenior, MWest, REWilliams, SMWu, RLHwa, JPatel, BZheng, SSondey, CPalani, A Discovery of a potent thiadiazole class of histamine h3 receptor antagonist for the treatment of diabetes. ACS Med Chem Lett3:198-202 (2012) 
 
Histamine H3 receptor
Name:Histamine H3 receptor
Type:G Protein-Coupled Receptor (GPCR)
Mol. Mass.:48691.47
Organism:Homo sapiens (Human)
Description:Binding assays were using CHO cells stably expressing hH3R receptors.
Residue:445
BDBM50333504
NameBDBM50333504
Synonyms:1-(5-(1,4'-bipiperidin-1'-yl)-1,3,4-thiadiazol-2-yl)-3-cyclopentylurea | CHEMBL1641821
TypeSmall organic molecule
Emp. Form.C18H30N6OS
Mol. Mass.378.535
SMILESO=C(NC1CCCC1)Nc1nnc(s1)N1CCC(CC1)N1CCCCC1