Reaction Details
TargetHistamine H3 receptor
LigandBDBM50386364
Substrate/Competitorn/a
Meas. Tech.ChEMBL_826696 (CHEMBL2051143)
Ki 7±n/a nM
Citation Rao, AUShao, NAslanian, RGChan, TYDegrado, SJWang, LMcKittrick, BSenior, MWest, REWilliams, SMWu, RLHwa, JPatel, BZheng, SSondey, CPalani, A Discovery of a potent thiadiazole class of histamine h3 receptor antagonist for the treatment of diabetes. ACS Med Chem Lett3:198-202 (2012) 
 
Histamine H3 receptor
Name:Histamine H3 receptor
Type:PROTEIN
Mol. Mass.:48560.37
Organism:Mus musculus
Description:ChEMBL_988451
Residue:445
BDBM50386364
NameBDBM50386364
Synonyms:CHEMBL2048592
TypeSmall organic molecule
Emp. Form.C22H31FN6S
Mol. Mass.430.585
SMILESFC1(CCCN(C1)c1nnc(s1)N1CCC(CC1)N1CCCCC1)c1ccccn1