Reaction Details
TargetMu-type opioid receptor
LigandBDBM50386380
Substrate/Competitorn/a
Meas. Tech.ChEMBL_826807 (CHEMBL2051428)
Ki 7.8±n/a nM
Citation Renton, PGreen, BMaddaford, SRakhit, SAndrews, JS NOpiates: Novel Dual Action Neuronal Nitric Oxide Synthase Inhibitors with µ-Opioid Agonist Activity. ACS Med Chem Lett3:227-231 (2012) 
 
Mu-type opioid receptor
Name:Mu-type opioid receptor
Type:G Protein-Coupled Receptor (GPCR)
Mol. Mass.:44789.51
Organism:Homo sapiens (Human)
Description:P35372
Residue:400
BDBM50386380
NameBDBM50386380
Synonyms:CHEMBL2048417
TypeSmall organic molecule
Emp. Form.C27H33N5OS
Mol. Mass.475.649
SMILESCCOc1ccc(Cc2nc3ccc(cc3n2CCN(CC)CC)N=C(N)c2cccs2)cc1