Reaction Details
TargetMu-type opioid receptor
LigandBDBM50386677
Substrate/Competitorn/a
Meas. Tech.ChEMBL_827233 (CHEMBL2050632)
Ki 0.430000±n/a nM
Citation Neumeyer, JLZhang, BZhang, TSromek, AWKnapp, BICohen, DJBidlack, JM Synthesis, binding affinity, and functional in vitro activity of 3-benzylaminomorphinan and 3-benzylaminomorphine ligands at opioid receptors. J Med Chem55:3878-90 (2012) 
 
Mu-type opioid receptor
Name:Mu-type opioid receptor
Type:G Protein-Coupled Receptor (GPCR)
Mol. Mass.:44789.51
Organism:Homo sapiens (Human)
Description:P35372
Residue:400
BDBM50386677
NameBDBM50386677
Synonyms:CHEMBL2048767
TypeSmall organic molecule
Emp. Form.C28H35N3O2
Mol. Mass.445.5964
SMILES[O-][N+](=O)c1cccc(CNc2ccc3C[C@@H]4[C@@H]5CCCC[C@]5(CCN4CC4CCC4)c3c2)c1