Reaction Details
TargetDelta-type opioid receptor
LigandBDBM50386668
Substrate/Competitorn/a
Meas. Tech.ChEMBL_827236 (CHEMBL2050635)
Ki 730±n/a nM
Citation Neumeyer, JLZhang, BZhang, TSromek, AWKnapp, BICohen, DJBidlack, JM Synthesis, binding affinity, and functional in vitro activity of 3-benzylaminomorphinan and 3-benzylaminomorphine ligands at opioid receptors. J Med Chem55:3878-90 (2012) 
 
Delta-type opioid receptor
Name:Delta-type opioid receptor
Type:G Protein-Coupled Receptor (GPCR)
Mol. Mass.:40382.98
Organism:Homo sapiens (Human)
Description:Competition binding assays were carried out using membrane preparations from transfected HN9.10 cells that constitutively expressed the delta opioid receptor.
Residue:372
BDBM50386668
NameBDBM50386668
Synonyms:CHEMBL2048778
TypeSmall organic molecule
Emp. Form.C29H37ClN2
Mol. Mass.449.07
SMILESCN(Cc1ccc(Cl)cc1)c1ccc2C[C@@H]3[C@@H]4CCCC[C@]4(CCN3CC3CCC3)c2c1