Reaction Details
TargetMu-type opioid receptor
LigandBDBM50386666
Substrate/Competitorn/a
Meas. Tech.ChEMBL_827233 (CHEMBL2050632)
Ki 3.2±n/a nM
Citation Neumeyer, JLZhang, BZhang, TSromek, AWKnapp, BICohen, DJBidlack, JM Synthesis, binding affinity, and functional in vitro activity of 3-benzylaminomorphinan and 3-benzylaminomorphine ligands at opioid receptors. J Med Chem55:3878-90 (2012) 
 
Mu-type opioid receptor
Name:Mu-type opioid receptor
Type:G Protein-Coupled Receptor (GPCR)
Mol. Mass.:44789.51
Organism:Homo sapiens (Human)
Description:P35372
Residue:400
BDBM50386666
NameBDBM50386666
Synonyms:CHEMBL2048780
TypeSmall organic molecule
Emp. Form.C29H38N2O
Mol. Mass.430.6248
SMILESCN(Cc1ccc(O)cc1)c1ccc2C[C@@H]3[C@@H]4CCCC[C@]4(CCN3CC3CCC3)c2c1