Reaction Details
TargetEpidermal growth factor receptor
LigandBDBM50386701
Substrate/Competitorn/a
Meas. Tech.ChEMBL_827250 (CHEMBL2050649)
IC50 2.9±n/a nM
Citation Kawakita, YBanno, HOhashi, TTamura, TYusa, TNakayama, AMiki, HIwata, HKamiguchi, HTanaka, THabuka, NSogabe, SOhta, YIshikawa, T Design and synthesis of pyrrolo[3,2-d]pyrimidine human epidermal growth factor receptor 2 (HER2)/epidermal growth factor receptor (EGFR) dual inhibitors: exploration of novel back-pocket binders. J Med Chem55:3975-91 (2012) 
 
Epidermal growth factor receptor
Name:Epidermal growth factor receptor
Type:Receptor Kinase Domain
Mol. Mass.:134279.59
Organism:Homo sapiens (Human)
Description:P00533
Residue:1210
BDBM50386701
NameBDBM50386701
Synonyms:CHEMBL2048906
TypeSmall organic molecule
Emp. Form.C23H19ClN6O2S
Mol. Mass.478.954
SMILESCC(=O)NCCn1ccc2ncnc(Nc3ccc(Oc4cccc5sncc45)c(Cl)c3)c12