Reaction Details
TargetReceptor tyrosine-protein kinase erbB-2
LigandBDBM50386704
Substrate/Competitorn/a
Meas. Tech.ChEMBL_827249 (CHEMBL2050648)
IC50 1.7±n/a nM
Citation Kawakita, YBanno, HOhashi, TTamura, TYusa, TNakayama, AMiki, HIwata, HKamiguchi, HTanaka, THabuka, NSogabe, SOhta, YIshikawa, T Design and synthesis of pyrrolo[3,2-d]pyrimidine human epidermal growth factor receptor 2 (HER2)/epidermal growth factor receptor (EGFR) dual inhibitors: exploration of novel back-pocket binders. J Med Chem55:3975-91 (2012) 
 
Receptor tyrosine-protein kinase erbB-2
Name:Receptor tyrosine-protein kinase erbB-2
Type:n/a
Mol. Mass.:137894.47
Organism:Homo sapiens (Human)
Description:P04626
Residue:1255
BDBM50386704
NameBDBM50386704
Synonyms:CHEMBL2048903
TypeSmall organic molecule
Emp. Form.C21H17ClN6O2
Mol. Mass.420.852
SMILESOCCn1ccc2ncnc(Nc3ccc(Oc4cccc5[nH]ncc45)c(Cl)c3)c12