Reaction Details
TargetPlatelet-derived growth factor receptor alpha
LigandBDBM50386693
Substrate/Competitorn/a
Meas. Tech.ChEMBL_826395 (CHEMBL2049406)
IC50>10000±n/a nM
Citation Kawakita, YBanno, HOhashi, TTamura, TYusa, TNakayama, AMiki, HIwata, HKamiguchi, HTanaka, THabuka, NSogabe, SOhta, YIshikawa, T Design and synthesis of pyrrolo[3,2-d]pyrimidine human epidermal growth factor receptor 2 (HER2)/epidermal growth factor receptor (EGFR) dual inhibitors: exploration of novel back-pocket binders. J Med Chem55:3975-91 (2012) 
 
Platelet-derived growth factor receptor alpha
Name:Platelet-derived growth factor receptor alpha
Type:Protein
Mol. Mass.:122633.38
Organism:Homo sapiens (Human)
Description:P16234
Residue:1089
BDBM50386693
NameBDBM50386693
Synonyms:CHEMBL2048912
TypeSmall organic molecule
Emp. Form.C25H24ClN7O2S
Mol. Mass.522.022
SMILESCC(C)(N)C(=O)NCCn1ccc2ncnc(Nc3ccc(Oc4cccc5sncc45)c(Cl)c3)c12