Reaction Details
TargetCarbonic anhydrase 1
LigandBDBM50386732
Substrate/Competitorn/a
Meas. Tech.ChEMBL_826443 (CHEMBL2049494)
Ki 6.7±n/a nM
Citation Gitto, RDamiano, FMMader, PDe Luca, LFerro, SSupuran, CTVullo, DBrynda, JRezácová, PChimirri, A Synthesis, structure-activity relationship studies, and X-ray crystallographic analysis of arylsulfonamides as potent carbonic anhydrase inhibitors. J Med Chem55:3891-9 (2012) 
 
Carbonic anhydrase 1
Name:Carbonic anhydrase 1
Type:Enzyme
Mol. Mass.:28873.37
Organism:Homo sapiens (Human)
Description:P00915
Residue:261
BDBM50386732
NameBDBM50386732
Synonyms:CHEMBL2048935
TypeSmall organic molecule
Emp. Form.C18H23N3O5S2
Mol. Mass.425.522
SMILESCCCOc1ccc2C(N(CCc2c1)S(N)(=O)=O)c1ccc(cc1)S(N)(=O)=O