Reaction Details
TargetCarbonic anhydrase 2
LigandBDBM50386715
Substrate/Competitorn/a
Meas. Tech.ChEMBL_826444 (CHEMBL2049495)
Ki 2.7±n/a nM
Citation Gitto, RDamiano, FMMader, PDe Luca, LFerro, SSupuran, CTVullo, DBrynda, JRezácová, PChimirri, A Synthesis, structure-activity relationship studies, and X-ray crystallographic analysis of arylsulfonamides as potent carbonic anhydrase inhibitors. J Med Chem55:3891-9 (2012) 
 
Carbonic anhydrase 2
Name:Carbonic anhydrase 2
Type:Enzyme
Mol. Mass.:29250.71
Organism:Homo sapiens (Human)
Description:P00918
Residue:260
BDBM50386715
NameBDBM50386715
Synonyms:CHEMBL2048917
TypeSmall organic molecule
Emp. Form.C17H20N2O5S
Mol. Mass.364.416
SMILESCOc1ccc(CCNC(=O)c2ccc(cc2)S(N)(=O)=O)cc1OC