Reaction Details
TargetCarbonic anhydrase 2
LigandBDBM10888
Substrate/Competitorn/a
Meas. Tech.ChEMBL_826444 (CHEMBL2049495)
Ki 35±n/a nM
Citation Gitto, RDamiano, FMMader, PDe Luca, LFerro, SSupuran, CTVullo, DBrynda, JRezácová, PChimirri, A Synthesis, structure-activity relationship studies, and X-ray crystallographic analysis of arylsulfonamides as potent carbonic anhydrase inhibitors. J Med Chem55:3891-9 (2012) 
 
Carbonic anhydrase 2
Name:Carbonic anhydrase 2
Type:Enzyme
Mol. Mass.:29250.71
Organism:Homo sapiens (Human)
Description:P00918
Residue:260
BDBM10888
NameBDBM10888
Synonyms:1,2-benzoxazol-3-ylmethanesulfonamide SPR_2 Zonisamide Zonisamide (ZNS) Zonisamide, ZNS
TypeSmall organic molecule
Emp. Form.C8H8N2O3S
Mol. Mass.212.226
SMILESNS(=O)(=O)Cc1noc2ccccc12