Reaction Details
TargetDual specificity protein kinase TTK
LigandBDBM50386830
Substrate/Competitorn/a
Meas. Tech.ChEMBL_828454 (CHEMBL2049891)
IC50 1±n/a nM
Citation Vijay Kumar, DHoarau, CBursavich, MSlattum, PGerrish, DYager, KSaunders, MShenderovich, MRoth, BLMcKinnon, RChan, ACimbora, DMBradford, CReeves, LPatton, SPapac, DIWilliams, BLCarlson, RO Lead optimization of purine based orally bioavailable Mps1 (TTK) inhibitors. Bioorg Med Chem Lett22:4377-85 (2012) 
 
Dual specificity protein kinase TTK
Name:Dual specificity protein kinase TTK
Type:Protein
Mol. Mass.:97086.79
Organism:Homo sapiens (Human)
Description:P33981
Residue:857
BDBM50386830
NameBDBM50386830
Synonyms:CHEMBL2047958
TypeSmall organic molecule
Emp. Form.C22H30N8O
Mol. Mass.422.5266
SMILESCOc1cc(ccc1Nc1nc(NC2CCCCC2)c2[nH]cnc2n1)N1CCNCC1